BDBM50483145 CHEMBL1630080
SMILES C[C@@H](OC(=O)Nc1cccc(F)c1)c1sc2nncn2c1C
InChI Key InChIKey=HXUSUWGGPOJXNZ-SECBINFHSA-N
Data  3 IC50
  Tab Delimited (TSV)   2D SDfile   Computed 3D by Vconf -m prep SDfile
Find this compound or compounds like it in BindingDB:
Activity Spreadsheet -- Enzyme Inhibition Constant Data from BindingDB
Found 3 hits for monomerid = 50483145
TargetMetabotropic glutamate receptor 5(Homo sapiens (Human))
Medicines Research Centre
Curated by ChEMBL
LigandPNGBDBM50483145(CHEMBL1630080)
Affinity DataIC50: <5.01E+4nM. Assay description: Antagonist activity at mGluR5
Ligand InfoPC cidPC sid
In DepthDetails ArticlePubMed
TargetMetabotropic glutamate receptor 5(Homo sapiens (Human))
Medicines Research Centre
Curated by ChEMBL
LigandPNGBDBM50483145(CHEMBL1630080)
Affinity DataIC50:  40nM. Assay description: Antagonist activity at human mGluR5 expressed in CHO cells assessed as doxycycline induced calcium mobilization
Ligand InfoPC cidPC sid
In DepthDetails ArticlePubMed
TargetMetabotropic glutamate receptor 5(Mus musculus)
Medicines Research Centre
Curated by ChEMBL
LigandPNGBDBM50483145(CHEMBL1630080)
Affinity DataIC50:  32nM. Assay description: Antagonist activity at mGluR5 in mouse astrocytes assessed as inhibition of L-quisqualate induced calcium release by FLIPR assay
Ligand InfoPC cidPC sid
In DepthDetails ArticlePubMed