BDBM50483322 CHEMBL1651644
SMILES CC(C)c1c(Cc2ccccc2)n(COCc2ccccc2)c(=O)n(N)c1=O
InChI Key InChIKey=LKSHSSGONRYXRP-UHFFFAOYSA-N
Data  1 IC50
  Tab Delimited (TSV)   2D SDfile   Computed 3D by Vconf -m prep SDfile
Find this compound or compounds like it in BindingDB:
Activity Spreadsheet -- Enzyme Inhibition Constant Data from BindingDB
Found 1 hit for monomerid = 50483322
TargetReverse transcriptase(Human immunodeficiency virus 1)
University Of Minnesota
Curated by ChEMBL
LigandPNGBDBM50483322(CHEMBL1651644)
Affinity DataIC50:  1.50E+3nM. Assay description: Inhibition of HIV1 reverse transcriptase
Ligand InfoPC cidPC sid
In DepthDetails ArticlePubMed