BDBM50483331 CHEMBL1651597
SMILES CONC(=S)N\N=C1/C(=O)N(CN2CCN(CC2)c2ccc(Cl)cc2)c2ccc(F)cc12
InChI Key InChIKey=BZRIUHMYGKEDFM-CLCOLTQESA-N
Data  1 IC50
  Tab Delimited (TSV)   2D SDfile   Computed 3D by Vconf -m prep SDfile
Find this compound or compounds like it in BindingDB:
Activity Spreadsheet -- Enzyme Inhibition Constant Data from BindingDB
Found 1 hit for monomerid = 50483331
TargetReverse transcriptase(Human immunodeficiency virus 1)
Birla Institute Of Technology & Science-Pilani
Curated by ChEMBL
LigandPNGBDBM50483331(CHEMBL1651597)
Affinity DataIC50:  1.67E+4nM. Assay description: Inhibition of HIV1 reverse transcriptase
Ligand InfoPC cidPC sid
In DepthDetails ArticlePubMed