BDBM50483362 CHEMBL1669248
SMILES COc1cc2c(cn(Cc3ccc(F)cc3)c2cc1OC)C(=O)\C=C(/O)C(O)=O
InChI Key InChIKey=YFFKBROBBNMSOC-NVMNQCDNSA-N
Data  1 IC50
  Tab Delimited (TSV)   2D SDfile   Computed 3D by Vconf -m prep SDfile
Find this compound or compounds like it in BindingDB:
Activity Spreadsheet -- Enzyme Inhibition Constant Data from BindingDB
Found 1 hit for monomerid = 50483362
TargetIntegrase(Human immunodeficiency virus 1)
University Of Messina
Curated by ChEMBL
LigandPNGBDBM50483362(CHEMBL1669248)
Affinity DataIC50:  547nM. Assay description: Inhibition of HIV-1 integrase after 1 hr by ELISA
Ligand InfoPC cidPC sid
In DepthDetails ArticlePubMed