BDBM50484041 CHEMBL1801254
SMILES [O-][n+]1ccc(cc1)-c1cc(COc2ccc(Cl)c(Oc3cc(Cl)cc(c3)C#N)c2)n[nH]1
InChI Key InChIKey=CZHJQAJYLJCDOF-UHFFFAOYSA-N
Data  3 KI
  Tab Delimited (TSV)   2D SDfile   Computed 3D by Vconf -m prep SDfile
Find this compound or compounds like it in BindingDB:
Activity Spreadsheet -- Enzyme Inhibition Constant Data from BindingDB
Found 3 hits for monomerid = 50484041
TargetReverse transcriptase(Human immunodeficiency virus 1)
Merck Research Laboratory
Curated by ChEMBL
LigandPNGBDBM50484041(CHEMBL1801254)
Affinity DataKi:  5.30nM. Assay description: Inhibition of wild type HIV1 reverse transcriptase by SPA assay
Ligand InfoPC cidPC sid
In DepthDetails ArticlePubMed
TargetReverse transcriptase protein(Human immunodeficiency virus 1)
Merck Research Laboratory
Curated by ChEMBL
LigandPNGBDBM50484041(CHEMBL1801254)
Affinity DataKi:  21nM. Assay description: Inhibition of HIV1 reverse transcriptase K103N mutant by SPA assay
Ligand InfoPC cidPC sid
In DepthDetails ArticlePubMed
TargetReverse transcriptase(Human immunodeficiency virus 1)
Merck Research Laboratory
Curated by ChEMBL
LigandPNGBDBM50484041(CHEMBL1801254)
Affinity DataKi:  46nM. Assay description: Inhibition of HIV1 reverse transcriptase Y181C mutant by SPA assay
Ligand InfoPC cidPC sid
In DepthDetails ArticlePubMed