BDBM50484632 Mk-6186::Mk6186
SMILES Clc1cc(Oc2c(Cl)ccc3n(Cc4n[nH]c5ncccc45)ncc23)cc(c1)C#N
InChI Key InChIKey=FZBAOOQVQXATRL-UHFFFAOYSA-N
Data  1 KI
  Tab Delimited (TSV)   2D SDfile   Computed 3D by Vconf -m prep SDfile
Find this compound or compounds like it in BindingDB:
Activity Spreadsheet -- Enzyme Inhibition Constant Data from BindingDB
Found 1 hit for monomerid = 50484632
TargetReverse transcriptase protein(Human immunodeficiency virus 1)
Merck
Curated by ChEMBL
LigandPNGBDBM50484632(Mk-6186 | Mk6186)
Affinity DataKi:  0.580nM. Assay description: Inhibition of Human immunodeficiency virus reverse transcriptase K103N mutant by SPA assay
In DepthDetails ArticlePubMed