BDBM50484779 CHEMBL1958446
SMILES COc1ccc(cc1)S(=O)(=O)N\N=C\c1cccc(c1O)[N+]([O-])=O
InChI Key InChIKey=AKNZPQJWRNKNMU-OQLLNIDSSA-N
Data  2 IC50
  Tab Delimited (TSV)   2D SDfile   Computed 3D by Vconf -m prep SDfile
Find this compound or compounds like it in BindingDB:
Activity Spreadsheet -- Enzyme Inhibition Constant Data from BindingDB
Found 2 hits for monomerid = 50484779
TargetReverse transcriptase(Human immunodeficiency virus 1)
Universit£
Curated by ChEMBL
LigandPNGBDBM50484779(CHEMBL1958446)
Affinity DataIC50:  1.00E+5nM. Assay description: Inhibition of ribonuclease H activity of HIV1 reverse transcriptase using as poly(dC)-[3H]poly(rG) as substrate
Ligand InfoPC cidPC sid
In DepthDetails ArticlePubMed
TargetReverse transcriptase(Human immunodeficiency virus 1)
Universit£
Curated by ChEMBL
LigandPNGBDBM50484779(CHEMBL1958446)
Affinity DataIC50: >1.00E+5nM. Assay description: Inhibition of RNA-dependent DNA polymerase activity of Human immunodeficiency virus 1 reverse transcriptase
Ligand InfoPC cidPC sid
In DepthDetails ArticlePubMed