BDBM50484808 CHEMBL1958233::NSC-205497
SMILES COc1ccccc1C(=O)N\N=C\c1c(O)ccc2ccccc12
InChI Key InChIKey=SGIUPSNOFYYWMP-UDWIEESQSA-N
Data  3 IC50
  Tab Delimited (TSV)   2D SDfile   Computed 3D by Vconf -m prep SDfile
Find this compound or compounds like it in BindingDB:
Activity Spreadsheet -- Enzyme Inhibition Constant Data from BindingDB
Found 3 hits for monomerid = 50484808
TargetReverse transcriptase(Human immunodeficiency virus 1)
Universit£
Curated by ChEMBL
LigandPNGBDBM50484808(CHEMBL1958233 | NSC-205497)
Affinity DataIC50: >1.00E+5nM. Assay description: Inhibition of RNA-dependent DNA polymerase activity of Human immunodeficiency virus 1 reverse transcriptase
In DepthDetails ArticlePubMed
TargetIndoleamine 2,3-dioxygenase 1(Homo sapiens (Human))
China Pharmaceutical University
Curated by ChEMBL
LigandPNGBDBM50484808(CHEMBL1958233 | NSC-205497)
Affinity DataIC50:  1.13E+4nM. Assay description: Inhibition of IDO1 in IFN-gamma stimulated human HeLa cells assessed as reduction in kynurenine production using L-tryptophan as substrate incubated ...
In DepthDetails ArticlePubMed
TargetReverse transcriptase(Human immunodeficiency virus 1)
Universit£
Curated by ChEMBL
LigandPNGBDBM50484808(CHEMBL1958233 | NSC-205497)
Affinity DataIC50:  2.10E+4nM. Assay description: Inhibition of ribonuclease H activity of HIV1 reverse transcriptase using as poly(dC)-[3H]poly(rG) as substrate
In DepthDetails ArticlePubMed