BDBM50485112 CHEMBL2030733
SMILES Oc1nc(O)c2ccn(CCCCCCCCP(O)(O)=O)c2n1
InChI Key InChIKey=RSIYHJRJHUVHDW-UHFFFAOYSA-N
Data  1 KI
  Tab Delimited (TSV)   2D SDfile   Computed 3D by Vconf -m prep SDfile
Find this compound or compounds like it in BindingDB:
Activity Spreadsheet -- Enzyme Inhibition Constant Data from BindingDB
Found 1 hit for monomerid = 50485112
TargetThymidine phosphorylase(Escherichia coli)
Universit£
Curated by ChEMBL
LigandPNGBDBM50485112(CHEMBL2030733)
Affinity DataKi:  5.40E+4nM. Assay description: Competitive inhibition of Escherichia coli thymidine phosphorylase incubated for 20 mins at room temperature followed by 5 mins incubation at 90 degC...
Ligand InfoPC cidPC sid
In DepthDetails ArticlePubMed