BDBM50485123 CHEMBL2031099
SMILES COC(=O)N[C@H](C(=O)NN(CCC[C@]1(Cc2ccccc2)[C@H](O)CN([C@@H]2[C@H](O)Cc3ccccc23)C1=O)Cc1ccc(cc1)-c1ccccc1)C(C)(C)C
InChI Key InChIKey=YNPGDSJLNVNNFA-MIYQMFTLSA-N
Data  1 KI
PDB links: 1 PDB ID matches this monomer.
  Tab Delimited (TSV)   2D SDfile   Computed 3D by Vconf -m prep SDfile
Find this compound or compounds like it in BindingDB:
Activity Spreadsheet -- Enzyme Inhibition Constant Data from BindingDB
Found 1 hit for monomerid = 50485123
TargetProtease(Human immunodeficiency virus 1 (HIV-1))
Uppsala University
Curated by ChEMBL
LigandPNGBDBM50485123(CHEMBL2031099)
Affinity DataKi:  12nM. Assay description: Inhibition of HIV1 protease expressed in Escherichia coli using DABCYL-Abu-Ser-Gln-ASN-Tyr-Pro-Ile-Val-Gln-EDANS as substrate preincubated for 20 min...
Ligand InfoPC cidPC sidPDB