BDBM50485124 CHEMBL2031100
SMILES COC(=O)N[C@H](C(=O)NN(CCC[C@]1(Cc2ccccc2)[C@H](O)CN([C@@H]2[C@H](O)Cc3ccccc23)C1=O)Cc1ccc(cc1)-c1cccnc1)C(C)(C)C
InChI Key InChIKey=AJKIUJAKGPSKCA-NPHQGNLKSA-N
Data  1 KI
  Tab Delimited (TSV)   2D SDfile   Computed 3D by Vconf -m prep SDfile
Find this compound or compounds like it in BindingDB:
Activity Spreadsheet -- Enzyme Inhibition Constant Data from BindingDB
Found 1 hit for monomerid = 50485124
TargetProtease(Human immunodeficiency virus 1 (HIV-1))
Uppsala University
Curated by ChEMBL
LigandPNGBDBM50485124(CHEMBL2031100)
Affinity DataKi:  5.30nM. Assay description: Inhibition of HIV1 protease expressed in Escherichia coli using DABCYL-Abu-Ser-Gln-ASN-Tyr-Pro-Ile-Val-Gln-EDANS as substrate preincubated for 20 min...
Ligand InfoPC cidPC sid
In DepthDetails ArticlePubMed