BDBM50485608 CHEBI:28837::Caprylic acid::EDENOR C 8-98-100::FEMA NO. 2799::NSC-5024::Octanoic Acid
SMILES CCCCCCCC(O)=O
InChI Key InChIKey=WWZKQHOCKIZLMA-UHFFFAOYSA-N
Data  3 KI  2 EC50
PDB links: 44 PDB IDs match this monomer.
  Tab Delimited (TSV)   2D SDfile   Computed 3D by Vconf -m prep SDfile
Find this compound or compounds like it in BindingDB:
Activity Spreadsheet -- Enzyme Inhibition Constant Data from BindingDB
Found 5 hits for monomerid = 50485608
TargetSolute carrier family 22 member 6(Homo sapiens (Human))
Kyorin University
Curated by ChEMBL
LigandPNGBDBM50485608(CHEBI:28837 | Caprylic acid | EDENOR C 8-98-100 | ...)
Affinity DataKi:  5.41E+3nM. Assay description: TP_TRANSPORTER: inhibition of Ochratoxin A uptake in OAT1-expressing S2 cells
In DepthDetails ArticlePubMed
TargetSolute carrier family 22 member 8(Homo sapiens (Human))
Kyorin University
Curated by ChEMBL
LigandPNGBDBM50485608(CHEBI:28837 | Caprylic acid | EDENOR C 8-98-100 | ...)
Affinity DataKi:  8.60E+3nM. Assay description: TP_TRANSPORTER: inhibition of Ochratoxin A uptake in OAT3-expressing S2 cells
In DepthDetails ArticlePubMed
TargetG-protein coupled receptor 84(Homo sapiens (Human))
University Of Bonn
Curated by ChEMBL
LigandPNGBDBM50485608(CHEBI:28837 | Caprylic acid | EDENOR C 8-98-100 | ...)
Affinity DataKi:  1.96E+4nM. Assay description: Displacement of [3H]PSB-1584 from recombinant human GPR84 expressed in CHO cell membranes co-expressing beta-arrestin2 measured after 6 hrs by scinti...
In DepthDetails ArticlePubMed
TargetG-protein coupled receptor 84(Homo sapiens (Human))
University Of Bonn
Curated by ChEMBL
LigandPNGBDBM50485608(CHEBI:28837 | Caprylic acid | EDENOR C 8-98-100 | ...)
Affinity DataEC50: >1.00E+5nM. Assay description: Agonist activity at recombinant human GPR84 expressed in CHO cell membranes co-expressing beta-arrestin2 assessed as beta-arrestin 2 recruitment meas...
In DepthDetails ArticlePubMed
TargetG-protein coupled receptor 84(Homo sapiens (Human))
University Of Bonn
Curated by ChEMBL
LigandPNGBDBM50485608(CHEBI:28837 | Caprylic acid | EDENOR C 8-98-100 | ...)
Affinity DataEC50: >1.00E+5nM. Assay description: Agonist activity at recombinant human GPR84 expressed in CHO cell membranes co-expressing beta-arrestin2 assessed as inhibition of forskolin-stimulat...
In DepthDetails ArticlePubMed