BDBM50486106 CHEMBL2203878
SMILES [H][C@@]12CCC(C1)CCCc1cc3c(O[C@]4([H])C[C@H](N(C4)C(=O)[C@@H](NC(=O)O2)C2CCCC2)C(=O)N[C@@]2(C[C@H]2C=C)C(=O)NS(=O)(=O)C2CC2)cc(OCC)nc3cc1OC
InChI Key InChIKey=GWHAYGBTKMWEDP-VJSYKJSMSA-N
Data  2 KI
  Tab Delimited (TSV)   2D SDfile   Computed 3D by Vconf -m prep SDfile
Find this compound or compounds like it in BindingDB:
Activity Spreadsheet -- Enzyme Inhibition Constant Data from BindingDB
Found 2 hits for monomerid = 50486106
TargetGenome polyprotein(Hepacivirus C)
Merck Research Laboratories
Curated by ChEMBL
LigandPNGBDBM50486106(CHEMBL2203878)
Affinity DataKi:  4.60nM. Assay description: Inhibition of HCV genotype 1b BK NS3/4A protease A156T mutant expressed in Escherichia coli incubated for 30 mins by time-resolved fluorescence assay
Ligand InfoPC cidPC sid
In DepthDetails ArticlePubMed
TargetGenome polyprotein(Hepacivirus C)
Merck Research Laboratories
Curated by ChEMBL
LigandPNGBDBM50486106(CHEMBL2203878)
Affinity DataKi:  46nM. Assay description: Inhibition of HCV genotype 1b BK NS3/4A protease A156V mutant expressed in Escherichia coli incubated for 30 mins by time-resolved fluorescence assay
Ligand InfoPC cidPC sid
In DepthDetails ArticlePubMed