BDBM50486275 CHEMBL2234402
SMILES CCN(CC)c1nc(C)cc(NC(=S)Nc2cccc(Br)c2)n1
InChI Key InChIKey=RSPCTNSOBBGJSK-UHFFFAOYSA-N
Data  1 Kd
  Tab Delimited (TSV)   2D SDfile   Computed 3D by Vconf -m prep SDfile
Find this compound or compounds like it in BindingDB:
Activity Spreadsheet -- Enzyme Inhibition Constant Data from BindingDB
Found 1 hit for monomerid = 50486275
TargetPeptidyl-prolyl cis-trans isomerase A(Homo sapiens (Human))TBA
LigandPNGBDBM50486275(CHEMBL2234402)
Affinity DataKd:  2.01E+5nM. Assay description: Binding affinity to Homo sapiens (human) cyclophilin A expressed in Escherichia coli BL21(DE3) by fluorescence titration assay
Ligand InfoPC cidPC sid
In DepthDetails Article