BDBM50487169 CHEMBL2251950
SMILES Cc1nc(cc2nc(nn12)S(=O)(=O)Nc1c(Cl)cccc1Cl)C(F)(F)F
InChI Key InChIKey=IWIVAMOZIDHPGR-UHFFFAOYSA-N
Data  1 KI
  Tab Delimited (TSV)   2D SDfile   Computed 3D by Vconf -m prep SDfile
Find this compound or compounds like it in BindingDB:
Activity Spreadsheet -- Enzyme Inhibition Constant Data from BindingDB
Found 1 hit for monomerid = 50487169
TargetAcetolactate synthase, chloroplastic(Arabidopsis thaliana)
Central China Normal University
Curated by ChEMBL
LigandPNGBDBM50487169(CHEMBL2251950)
Affinity DataKi:  5.02E+3nM. Assay description: Inhibition of wild type Arabidopsis thaliana acetolactate synthase by colorimetry
Ligand InfoPC cidPC sid
In DepthDetails ArticlePubMed