BDBM50487180 CHEMBL2251940
SMILES COc1ccn2nc(nc2n1)S(=O)(=O)Nc1ccc(OC(F)(F)F)cc1
InChI Key InChIKey=CQRWZXXYGSDASS-UHFFFAOYSA-N
Data  1 KI
  Tab Delimited (TSV)   2D SDfile   Computed 3D by Vconf -m prep SDfile
Find this compound or compounds like it in BindingDB:
Activity Spreadsheet -- Enzyme Inhibition Constant Data from BindingDB
Found 1 hit for monomerid = 50487180
TargetAcetolactate synthase, chloroplastic(Arabidopsis thaliana)
Central China Normal University
Curated by ChEMBL
LigandPNGBDBM50487180(CHEMBL2251940)
Affinity DataKi: >1.00E+6nM. Assay description: Inhibition of wild type Arabidopsis thaliana acetolactate synthase by colorimetry
Ligand InfoPC cidPC sid
In DepthDetails ArticlePubMed