BDBM50487181 CHEMBL2251958
SMILES COc1ccn2nc(nc2n1)S(=O)(=O)Nc1ccccc1F
InChI Key InChIKey=AWLHBCJOZZFZQT-UHFFFAOYSA-N
Data  1 KI
  Tab Delimited (TSV)   2D SDfile   Computed 3D by Vconf -m prep SDfile
Find this compound or compounds like it in BindingDB:
Activity Spreadsheet -- Enzyme Inhibition Constant Data from BindingDB
Found 1 hit for monomerid = 50487181
TargetAcetolactate synthase, chloroplastic(Arabidopsis thaliana)
Central China Normal University
Curated by ChEMBL
LigandPNGBDBM50487181(CHEMBL2251958)
Affinity DataKi:  2.59E+4nM. Assay description: Inhibition of wild type Arabidopsis thaliana acetolactate synthase by colorimetry
Ligand InfoPC cidPC sid
In DepthDetails ArticlePubMed