BDBM50487848 CHEMBL2259849
SMILES Oc1cc2occc2cc1C(=O)\C=C\c1ccccc1
InChI Key InChIKey=KWHQNOLEBMDRAX-VOTSOKGWSA-N
Data  1 IC50
  Tab Delimited (TSV)   2D SDfile   Computed 3D by Vconf -m prep SDfile
Find this compound or compounds like it in BindingDB:
Activity Spreadsheet -- Enzyme Inhibition Constant Data from BindingDB
Found 1 hit for monomerid = 50487848
TargetLysosomal alpha-glucosidase(Rattus norvegicus)TBA
LigandPNGBDBM50487848(CHEMBL2259849)
Affinity DataIC50:  1.45E+4nM. Assay description: Inhibition of rat intestinal alpha-glucosidase using para-nitrophenyl-alpha-D-glucopyranoside as substrate incubated for 5 min prior to substrate add...
Ligand InfoPC cidPC sid
In DepthDetails Article