BDBM50487935 CHEMBL2261302
SMILES COc1cc2c3c(oc(=O)c4cc(O)c(O)c(oc2=O)c34)c1O
InChI Key InChIKey=HJDSQISQUWFNIG-UHFFFAOYSA-N
Data  1 IC50
  Tab Delimited (TSV)   2D SDfile   Computed 3D by Vconf -m prep SDfile
Find this compound or compounds like it in BindingDB:
Activity Spreadsheet -- Enzyme Inhibition Constant Data from BindingDB
Found 1 hit for monomerid = 50487935
TargetAldo-keto reductase family 1 member B1(Rattus norvegicus)TBA
LigandPNGBDBM50487935(CHEMBL2261302)
Affinity DataIC50:  1.00E+4nM. Assay description: Inhibition of Rattus norvegicus (rat) lens aldose reductase
Ligand InfoPC cidPC sid
In DepthDetails Article