BDBM50489205 CHEMBL2315697
SMILES CC(C)[C@H](NC1=CC(=O)C(O)=C(C\C=C(/C)CC[C@@]2(C)CCC=C(C)[C@H]2C)C1=O)C(O)=O
InChI Key InChIKey=BJERDOMCCSOVLH-PITGTEGRSA-N
Data  2 IC50
  Tab Delimited (TSV)   2D SDfile   Computed 3D by Vconf -m prep SDfile
Find this compound or compounds like it in BindingDB:
Activity Spreadsheet -- Enzyme Inhibition Constant Data from BindingDB
Found 2 hits for monomerid = 50489205
TargetEpidermal growth factor receptor(Homo sapiens (Human))
Hokkaido University
Curated by ChEMBL
LigandPNGBDBM50489205(CHEMBL2315697)
Affinity DataIC50:  2.93E+5nM. Assay description: Inhibition of EGFR (unknown origin) by Z-LYTE assay
Ligand InfoPC cidPC sid
In DepthDetails ArticlePubMed
TargetReceptor tyrosine-protein kinase erbB-2(Homo sapiens (Human))
Hokkaido University
Curated by ChEMBL
LigandPNGBDBM50489205(CHEMBL2315697)
Affinity DataIC50:  7.89E+4nM. Assay description: Inhibition of HER2 (unknown origin) by Z-LYTE assay
Ligand InfoPC cidPC sid
In DepthDetails ArticlePubMed