BDBM50489341 CHEMBL2314617
SMILES [H][C@@]12COc3c(F)ccc(F)c3[C@@]1(CCO[C@H]2CCS(C)(=O)=O)S(=O)(=O)c1ccc(Br)cc1
InChI Key InChIKey=OEDGPKOJXFRUSK-XERREHJYSA-N
Data  3 IC50
  Tab Delimited (TSV)   2D SDfile   Computed 3D by Vconf -m prep SDfile
Find this compound or compounds like it in BindingDB:
Activity Spreadsheet -- Enzyme Inhibition Constant Data from BindingDB
Found 3 hits for monomerid = 50489341
TargetPresenilin-1(Homo sapiens (Human))
Merck Research Laboratories
Curated by ChEMBL
LigandPNGBDBM50489341(CHEMBL2314617)
Affinity DataIC50:  0.600nM. Assay description: Inhibition of gamma secretase-mediated amyloid beta42 production in HEK293 cells transfected with human APPSOW and APPLON after 5 hrs by sandwich imm...
Ligand InfoPC cidPC sid
In DepthDetails ArticlePubMed
TargetPresenilin-1(Homo sapiens (Human))
Merck Research Laboratories
Curated by ChEMBL
LigandPNGBDBM50489341(CHEMBL2314617)
Affinity DataIC50:  2.5nM. Assay description: Inhibition of gamma secretase-mediated amyloid beta40 production in HEK293 cells transfected with human APPSOW and APPLON after 5 hrs by sandwich imm...
Ligand InfoPC cidPC sid
In DepthDetails ArticlePubMed
TargetPresenilin-1(Homo sapiens (Human))
Merck Research Laboratories
Curated by ChEMBL
LigandPNGBDBM50489341(CHEMBL2314617)
Affinity DataIC50:  2.90nM. Assay description: Inhibition of gamma secretase-mediated amyloid beta40 production in HEK293 cell membranes transfected with human APPSOW and APPLON mutant after 5 hrs...
Ligand InfoPC cidPC sid
In DepthDetails ArticlePubMed