BDBM50489351 CHEMBL2314604
SMILES [H][C@@]12COc3c(F)ccc(F)c3[C@@]1(CCO[C@H]2CCS(=O)(=O)CC(O)=O)S(=O)(=O)c1ccc(Cl)cc1
InChI Key InChIKey=ZPMAVVZDYBVVFM-VPKVUBIPSA-N
Data  3 IC50
  Tab Delimited (TSV)   2D SDfile   Computed 3D by Vconf -m prep SDfile
Find this compound or compounds like it in BindingDB:
Activity Spreadsheet -- Enzyme Inhibition Constant Data from BindingDB
Found 3 hits for monomerid = 50489351
TargetPresenilin-1(Homo sapiens (Human))
Merck Research Laboratories
Curated by ChEMBL
LigandPNGBDBM50489351(CHEMBL2314604)
Affinity DataIC50:  22nM. Assay description: Inhibition of gamma secretase-mediated amyloid beta42 production in HEK293 cells transfected with human APPSOW and APPLON after 5 hrs by sandwich imm...
Ligand InfoPC cidPC sid
In DepthDetails ArticlePubMed
TargetPresenilin-1(Homo sapiens (Human))
Merck Research Laboratories
Curated by ChEMBL
LigandPNGBDBM50489351(CHEMBL2314604)
Affinity DataIC50:  38nM. Assay description: Inhibition of gamma secretase-mediated amyloid beta40 production in HEK293 cells transfected with human APPSOW and APPLON after 5 hrs by sandwich imm...
Ligand InfoPC cidPC sid
In DepthDetails ArticlePubMed
TargetPresenilin-1(Homo sapiens (Human))
Merck Research Laboratories
Curated by ChEMBL
LigandPNGBDBM50489351(CHEMBL2314604)
Affinity DataIC50:  2.70nM. Assay description: Inhibition of gamma secretase-mediated amyloid beta40 production in HEK293 cell membranes transfected with human APPSOW and APPLON mutant after 5 hrs...
Ligand InfoPC cidPC sid
In DepthDetails ArticlePubMed