BDBM50490719 CHEMBL2332897
SMILES CC(=O)N1N=C(CC1c1ccc(O)cc1)c1ccc(O)cc1O
InChI Key InChIKey=PVMFUGSGMITKLQ-UHFFFAOYSA-N
Data  1 IC50
  Tab Delimited (TSV)   2D SDfile   Computed 3D by Vconf -m prep SDfile
Find this compound or compounds like it in BindingDB:
Activity Spreadsheet -- Enzyme Inhibition Constant Data from BindingDB
Found 1 hit for monomerid = 50490719
TargetPolyphenol oxidase 2(Agaricus bisporus (Common mushroom))
Sun Yat-Sen University
Curated by ChEMBL
LigandPNGBDBM50490719(CHEMBL2332897)
Affinity DataIC50:  1.69E+3nM. Assay description: Inhibition of mushroom tyrosinase assessed as reduction in diphenolase activity using L-DOPA substrate pre-incubated for 20 mins at 30 degC
Ligand InfoPC cidPC sid
In DepthDetails ArticlePubMed