BDBM50491830 CHEMBL2387184
SMILES CCCCn1c2CCCCCCc2cc(C(=O)NC2CCN(C)CC2)c1=O
InChI Key InChIKey=NTSQQRGUOXVMIN-UHFFFAOYSA-N
Data  1 KI
  Tab Delimited (TSV)   2D SDfile   Computed 3D by Vconf -m prep SDfile
Find this compound or compounds like it in BindingDB:
Activity Spreadsheet -- Enzyme Inhibition Constant Data from BindingDB
Found 1 hit for monomerid = 50491830
TargetCannabinoid receptor 2(Homo sapiens (Human))
Shionogi Pharmaceutical Research Center
Curated by ChEMBL
LigandPNGBDBM50491830(CHEMBL2387184)
Affinity DataKi:  147nM. Assay description: Displacement of [3H]-CP-55,940 from human CB2 receptor expressed in CHO cell membranes
Ligand InfoPC cidPC sid
In DepthDetails ArticlePubMed