BDBM50491858 CHEMBL2387338
SMILES CC(C)C[C@H](NC(=O)[C@H](Cc1ccccc1)NC(=O)CNC(=O)CNC(=O)[C@@H](N)Cc1ccc(O)cc1)C(=O)NCC(=O)N(C1CCN(CCc2ccccc2)CC1)c1ccccc1
InChI Key InChIKey=WRWJIXPKEOGFRL-SVWSIEHRSA-N
Data  2 KI  2 IC50  2 EC50
  Tab Delimited (TSV)   2D SDfile   Computed 3D by Vconf -m prep SDfile
Find this compound or compounds like it in BindingDB:
Activity Spreadsheet -- Enzyme Inhibition Constant Data from BindingDB
Found 6 hits for monomerid = 50491858
TargetMu-type opioid receptor(Rattus norvegicus (rat))
University Of Arizona
Curated by ChEMBL
LigandPNGBDBM50491858(CHEMBL2387338)
Affinity DataKi:  0.0900nM. Assay description: Displacement of [3H]DAMGO from rat mu opioid receptor expressed in mouse HN9.10 cell membranes
Ligand InfoPC cidPC sid
In DepthDetails ArticlePubMed
TargetDelta-type opioid receptor(Homo sapiens (Human))
University Of Arizona
Curated by ChEMBL
LigandPNGBDBM50491858(CHEMBL2387338)
Affinity DataKi:  12nM. Assay description: Displacement of [3H]DPDPE from human delta opioid receptor expressed in mouse HN9.10 cell membranes
Ligand InfoPC cidPC sid
In DepthDetails ArticlePubMed
TargetMu-type opioid receptor(Rattus norvegicus (rat))
University Of Arizona
Curated by ChEMBL
LigandPNGBDBM50491858(CHEMBL2387338)
Affinity DataEC50:  45nM. Assay description: Agonist activity at rat mu opioid receptor expressed in CHO cells by [35S]GTP-gamma-S binding assay
Ligand InfoPC cidPC sid
In DepthDetails ArticlePubMed
TargetMu-type opioid receptor(GUINEA PIG)
University Of Arizona
Curated by ChEMBL
LigandPNGBDBM50491858(CHEMBL2387338)
Affinity DataIC50:  950nM. Assay description: Inhibition of mu opioid receptor in guinea pig ileum/longitudinal muscle with myenteric plexus assessed as inhibition of electrically-stimulated musc...
Ligand InfoPC cidPC sid
In DepthDetails ArticlePubMed
TargetDelta-type opioid receptor(Homo sapiens (Human))
University Of Arizona
Curated by ChEMBL
LigandPNGBDBM50491858(CHEMBL2387338)
Affinity DataEC50:  37nM. Assay description: Agonist activity at human delta opioid receptor expressed in CHO cells by [35S]GTP-gamma-S binding assay
Ligand InfoPC cidPC sid
In DepthDetails ArticlePubMed
TargetDelta-type opioid receptor(MOUSE)
University Of Arizona
Curated by ChEMBL
LigandPNGBDBM50491858(CHEMBL2387338)
Affinity DataIC50:  180nM. Assay description: Inhibition of delta opioid receptor in mouse vas deferens assessed as inhibition of electrically-stimulated muscle contraction
Ligand InfoPC cidPC sid
In DepthDetails ArticlePubMed