BDBM50492429 CHEMBL3215698
SMILES Cl.Cl.Cl.CN1CCN(Cc2cccc3c2oc2cc(Cl)ccc2c3=O)CC1
InChI Key InChIKey=RXSHWXGICAGMFZ-UHFFFAOYSA-N
Data  4 KI
  Tab Delimited (TSV)   2D SDfile   Computed 3D by Vconf -m prep SDfile
Find this compound or compounds like it in BindingDB:
Activity Spreadsheet -- Enzyme Inhibition Constant Data from BindingDB
Found 4 hits for monomerid = 50492429
TargetAlpha-1A/Alpha-1B/Alpha-1D adrenergic receptor(Rattus norvegicus (rat))
Jagiellonian University Medical College
Curated by ChEMBL
LigandPNGBDBM50492429(CHEMBL3215698)
Affinity DataKi:  650nM. Assay description: Displacement of [3H]prazosin from alpha1-adrenergic receptor in rat cerebral cortex after 30 mins by scintillation counting
Ligand InfoPC cidPC sid
In DepthDetails ArticlePubMed
Target5-hydroxytryptamine receptor 7(Homo sapiens (Human))
Jagiellonian University Medical College
Curated by ChEMBL
LigandPNGBDBM50492429(CHEMBL3215698)
Affinity DataKi:  1.05E+4nM. Assay description: Displacement of [3H]5-CT from human 5HT7b receptor expressed in HEK293 cells after 1 hr
Ligand InfoPC cidPC sid
In DepthDetails ArticlePubMed
Target5-hydroxytryptamine receptor 1A(Homo sapiens (Human))
Jagiellonian University Medical College
Curated by ChEMBL
LigandPNGBDBM50492429(CHEMBL3215698)
Affinity DataKi:  1.33E+4nM. Assay description: Displacement of [3H]8-OH-DPAT from human 5HT1A receptor expressed in HEK293 cells after 1 hr
Ligand InfoPC cidPC sid
In DepthDetails ArticlePubMed
Target5-hydroxytryptamine receptor 6(Homo sapiens (Human))
Jagiellonian University Medical College
Curated by ChEMBL
LigandPNGBDBM50492429(CHEMBL3215698)
Affinity DataKi:  1.95E+4nM. Assay description: Displacement of [3H]LSD from human 5HT6 receptor expressed in HEK293 cells after 1 hr
Ligand InfoPC cidPC sid
In DepthDetails ArticlePubMed