BDBM50493257 CHEMBL2425415
SMILES [#6]-[#8]-c1ccc(-[#7]-[#6](=S)-[#7]-[#7]\[#6]=[#6]-2\[#6](=O)-[#7]-[#6](=S)-[#7]-[#6]-2=O)cc1
InChI Key InChIKey=BCGOEEMRGGOWDE-UHFFFAOYSA-N
Data  2 IC50
  Tab Delimited (TSV)   2D SDfile   Computed 3D by Vconf -m prep SDfile
Find this compound or compounds like it in BindingDB:
Activity Spreadsheet -- Enzyme Inhibition Constant Data from BindingDB
Found 2 hits for monomerid = 50493257
TargetAcetylcholinesterase(Homo sapiens (Human))TBA
LigandPNGBDBM50493257(CHEMBL2425415)
Affinity DataIC50:  2.06E+5nM. Assay description: Inhibition of AChE (unknown origin) using acetyl thiocholine iodide as substrate after 30 mins by Ellman's method
Ligand InfoPC cidPC sid
In DepthDetails Article
TargetCholinesterase(Homo sapiens (Human))TBA
LigandPNGBDBM50493257(CHEMBL2425415)
Affinity DataIC50:  5.68E+4nM. Assay description: Inhibition of BChE (unknown origin) using butyryl thiocholine iodide as substrate after 30 mins by Ellman's method
Ligand InfoPC cidPC sid
In DepthDetails Article