BDBM50493261 CHEMBL2425411
SMILES [#6]-c1cccc(Cl)c1-[#7]-[#6](=S)-[#7]-[#7]\[#6]=[#6]-1\[#6](=O)-[#7]-[#6](=O)-[#7]-[#6]-1=O
InChI Key InChIKey=JDXMZCIREIBEQO-UHFFFAOYSA-N
Data  1 IC50
  Tab Delimited (TSV)   2D SDfile   Computed 3D by Vconf -m prep SDfile
Find this compound or compounds like it in BindingDB:
Activity Spreadsheet -- Enzyme Inhibition Constant Data from BindingDB
Found 1 hit for monomerid = 50493261
TargetCholinesterase(Homo sapiens (Human))TBA
LigandPNGBDBM50493261(CHEMBL2425411)
Affinity DataIC50:  8.81E+3nM. Assay description: Inhibition of BChE (unknown origin) using butyryl thiocholine iodide as substrate after 30 mins by Ellman's method
Ligand InfoPC cidPC sid
In DepthDetails Article