BDBM50493988 CHEBI:8024::McN-A-2833::Perindopril::S-9490
SMILES [H][C@]12C[C@H](N(C(=O)[C@H](C)N[C@@H](CCC)C(=O)OCC)[C@@]1([H])CCCC2)C(O)=O
InChI Key InChIKey=IPVQLZZIHOAWMC-QXKUPLGCSA-N
Data  1 IC50
  Tab Delimited (TSV)   2D SDfile   Computed 3D by Vconf -m prep SDfile
Find this compound or compounds like it in BindingDB:
Activity Spreadsheet -- Enzyme Inhibition Constant Data from BindingDB
Found 2 hits for monomerid = 50493988
TargetAngiotensin-converting enzyme(Homo sapiens (Human))TBA
LigandPNGBDBM50493988(CHEBI:8024 | McN-A-2833 | Perindopril | S-9490)
Affinity DataIC50:  3.60nM
In DepthDetails
TargetAngiotensin-converting enzyme(Homo sapiens (Human))TBA
LigandPNGBDBM50493988(CHEBI:8024 | McN-A-2833 | Perindopril | S-9490)
Affinity DataIC50:  1.5nM. Assay description: Inhibition of ACE (unknown origin)
In DepthDetails ArticlePubMed