BDBM50494056 CHEMBL2440700
SMILES Cl.[H][C@@]12CC[C@@H](C[C@]1([H])C[C@H](NC2)C(O)=O)Oc1cc(OC)ccc1C(O)=O
InChI Key InChIKey=NGEVJRORSXGUFY-VGFDZMLQSA-N
Data  2 KI
  Tab Delimited (TSV)   2D SDfile   Computed 3D by Vconf -m prep SDfile
Find this compound or compounds like it in BindingDB:
Activity Spreadsheet -- Enzyme Inhibition Constant Data from BindingDB
Found 2 hits for monomerid = 50494056
TargetGlutamate receptor ionotropic, kainate 1(Homo sapiens (Human))
Centro De Investigaci�N Lilly
Curated by ChEMBL
LigandPNGBDBM50494056(CHEMBL2440700)
Affinity DataKi:  6.20E+3nM. Assay description: Binding affinity to GluK1 receptor (unknown origin)
Ligand InfoPC cidPC sid
In DepthDetails ArticlePubMed
TargetGlutamate receptor 2(Homo sapiens (Human))
Centro De Investigaci�N Lilly
Curated by ChEMBL
LigandPNGBDBM50494056(CHEMBL2440700)
Affinity DataKi:  1.11E+5nM. Assay description: Binding affinity to GluA2 receptor (unknown origin)
Ligand InfoPC cidPC sid
In DepthDetails ArticlePubMed