BDBM50494697 CHEMBL3092818
SMILES CCCC(=O)OC[C@H]1O[C@H]([C@H](OC(=O)CCC)[C@@H](OC(=O)CCC)[C@H]1OC(=O)CCC)n1cc(nn1)-c1ccc(cc1)S(N)(=O)=O
InChI Key InChIKey=XDLCONKAGDFVRD-HXQMXDEDSA-N
Data  5 KI
  Tab Delimited (TSV)   2D SDfile   Computed 3D by Vconf -m prep SDfile
Find this compound or compounds like it in BindingDB:
Activity Spreadsheet -- Enzyme Inhibition Constant Data from BindingDB
Found 5 hits for monomerid = 50494697
TargetCarbonic anhydrase 2(Homo sapiens (Human))
Griffith University
Curated by ChEMBL
LigandPNGBDBM50494697(CHEMBL3092818)
Affinity DataKi:  6.90nM. Assay description: Inhibition of human carbonic anhydrase 2 by stopped-flow CO2 hydration assay
Ligand InfoPC cidPC sid
In DepthDetails ArticlePubMed
TargetCarbonic anhydrase 12(Homo sapiens (Human))
Griffith University
Curated by ChEMBL
LigandPNGBDBM50494697(CHEMBL3092818)
Affinity DataKi:  9.5nM. Assay description: Inhibition of human carbonic anhydrase 12 by stopped-flow CO2 hydration assay
Ligand InfoPC cidPC sid
In DepthDetails ArticlePubMed
TargetCarbonic anhydrase 14(Homo sapiens (Human))
Griffith University
Curated by ChEMBL
LigandPNGBDBM50494697(CHEMBL3092818)
Affinity DataKi:  36nM. Assay description: Inhibition of human carbonic anhydrase 14 by stopped-flow CO2 hydration assay
Ligand InfoPC cidPC sid
In DepthDetails ArticlePubMed
TargetCarbonic anhydrase 9(Homo sapiens (Human))
Griffith University
Curated by ChEMBL
LigandPNGBDBM50494697(CHEMBL3092818)
Affinity DataKi:  52nM. Assay description: Inhibition of human carbonic anhydrase 9 by stopped-flow CO2 hydration assay
Ligand InfoPC cidPC sid
In DepthDetails ArticlePubMed
TargetCarbonic anhydrase 1(Homo sapiens (Human))
Griffith University
Curated by ChEMBL
LigandPNGBDBM50494697(CHEMBL3092818)
Affinity DataKi:  257nM. Assay description: Inhibition of human carbonic anhydrase 1 by stopped-flow CO2 hydration assay
Ligand InfoPC cidPC sid
In DepthDetails ArticlePubMed