BDBM50494702 CHEMBL3092940
SMILES CC(C)CC(=O)OC[C@H]1O[C@H]([C@H](OC(=O)CC(C)C)[C@@H](OC(=O)CC(C)C)[C@@H]1OC(=O)CC(C)C)n1cc(nn1)-c1ccc(cc1)S(N)(=O)=O
InChI Key InChIKey=UFOZVEWEFIWWML-VQHOHFBQSA-N
Data  5 KI
  Tab Delimited (TSV)   2D SDfile   Computed 3D by Vconf -m prep SDfile
Find this compound or compounds like it in BindingDB:
Activity Spreadsheet -- Enzyme Inhibition Constant Data from BindingDB
Found 5 hits for monomerid = 50494702
TargetCarbonic anhydrase 14(Homo sapiens (Human))
Griffith University
Curated by ChEMBL
LigandPNGBDBM50494702(CHEMBL3092940)
Affinity DataKi:  40nM. Assay description: Inhibition of human carbonic anhydrase 14 by stopped-flow CO2 hydration assay
Ligand InfoPC cidPC sid
In DepthDetails ArticlePubMed
TargetCarbonic anhydrase 12(Homo sapiens (Human))
Griffith University
Curated by ChEMBL
LigandPNGBDBM50494702(CHEMBL3092940)
Affinity DataKi:  52nM. Assay description: Inhibition of human carbonic anhydrase 12 by stopped-flow CO2 hydration assay
Ligand InfoPC cidPC sid
In DepthDetails ArticlePubMed
TargetCarbonic anhydrase 9(Homo sapiens (Human))
Griffith University
Curated by ChEMBL
LigandPNGBDBM50494702(CHEMBL3092940)
Affinity DataKi:  426nM. Assay description: Inhibition of human carbonic anhydrase 9 by stopped-flow CO2 hydration assay
Ligand InfoPC cidPC sid
In DepthDetails ArticlePubMed
TargetCarbonic anhydrase 2(Homo sapiens (Human))
Griffith University
Curated by ChEMBL
LigandPNGBDBM50494702(CHEMBL3092940)
Affinity DataKi:  440nM. Assay description: Inhibition of human carbonic anhydrase 2 by stopped-flow CO2 hydration assay
Ligand InfoPC cidPC sid
In DepthDetails ArticlePubMed
TargetCarbonic anhydrase 1(Homo sapiens (Human))
Griffith University
Curated by ChEMBL
LigandPNGBDBM50494702(CHEMBL3092940)
Affinity DataKi:  9.44E+3nM. Assay description: Inhibition of human carbonic anhydrase 1 by stopped-flow CO2 hydration assay
Ligand InfoPC cidPC sid
In DepthDetails ArticlePubMed