BDBM50495074 CHEMBL3098601
SMILES [H][C@]1(NC(=O)[C@H](CCCCN)NC(=O)[C@H](Cc2c[nH]c3ccccc23)NC(=O)[C@H](Cc2ccccc2)NC(=O)[C@H](Cc2ccccc2)NC(=O)[C@H](CC(N)=O)NC(=O)[C@H](CCCCN)NC(=O)[C@H](C\C=C/C[C@H](NC(=O)[C@H](CO)NC(=O)[C@@]([H])(NC(=O)[C@H](Cc2ccccc2)NC1=O)[C@@H](C)O)C(N)=O)NC(=O)CNC(=O)[C@H](C)N)[C@@H](C)O
InChI Key InChIKey=GRXMDPIKHIFDPV-APLWEPAHSA-N
Data  5 KI
  Tab Delimited (TSV)   2D SDfile   Computed 3D by Vconf -m prep SDfile
Find this compound or compounds like it in BindingDB:
Activity Spreadsheet -- Enzyme Inhibition Constant Data from BindingDB
Found 5 hits for monomerid = 50495074
TargetSomatostatin receptor type 5(Homo sapiens (Human))
Institute For Research In Biomedicine (Irb Barcelona)
Curated by ChEMBL
LigandPNGBDBM50495074(CHEMBL3098601)
Affinity DataKi:  0.200nM. Assay description: Displacement of [125I]-somatostatin from human SSTR5 expressed in CHO-K1 cells
Ligand InfoKEGGPC cidPC sid
In DepthDetails ArticlePubMed
TargetSomatostatin receptor type 1(Homo sapiens (Human))
Institute For Research In Biomedicine (Irb Barcelona)
Curated by ChEMBL
LigandPNGBDBM50495074(CHEMBL3098601)
Affinity DataKi:  0.310nM. Assay description: Displacement of [125I]-somatostatin from human SSTR1 expressed in CHO-K1 cells
Ligand InfoKEGGPC cidPC sid
In DepthDetails ArticlePubMed
TargetSomatostatin receptor type 2(Homo sapiens (Human))
Institute For Research In Biomedicine (Irb Barcelona)
Curated by ChEMBL
LigandPNGBDBM50495074(CHEMBL3098601)
Affinity DataKi:  0.410nM. Assay description: Displacement of [125I]-somatostatin from human SSTR2 expressed in CHO-K1 cells
Ligand InfoKEGGPC cidPC sid
In DepthDetails ArticlePubMed
TargetSomatostatin receptor type 4(Homo sapiens (Human))
Institute For Research In Biomedicine (Irb Barcelona)
Curated by ChEMBL
LigandPNGBDBM50495074(CHEMBL3098601)
Affinity DataKi:  1.80nM. Assay description: Displacement of [125I]-somatostatin from human SSTR4 expressed in CHO-K1 cells
Ligand InfoKEGGPC cidPC sid
In DepthDetails ArticlePubMed
TargetSomatostatin receptor type 3(Homo sapiens (Human))
Institute For Research In Biomedicine (Irb Barcelona)
Curated by ChEMBL
LigandPNGBDBM50495074(CHEMBL3098601)
Affinity DataKi:  4.20nM. Assay description: Displacement of [125I]-somatostatin from human SSTR3 expressed in CHO-K1 cells
Ligand InfoKEGGPC cidPC sid
In DepthDetails ArticlePubMed