BDBM50496260 CHEMBL3127681
SMILES O=C(N1CCC2(C1)CCCN(C2)C1CCOCC1)N1CCCN(CC1)C1CCC1
InChI Key InChIKey=KXFALARAHWUZMG-UHFFFAOYSA-N
Data  2 IC50
  Tab Delimited (TSV)   2D SDfile   Computed 3D by Vconf -m prep SDfile
Find this compound or compounds like it in BindingDB:
Activity Spreadsheet -- Enzyme Inhibition Constant Data from BindingDB
Found 2 hits for monomerid = 50496260
TargetHistamine H3 receptor(Homo sapiens (Human))
Astrazeneca
Curated by ChEMBL
LigandPNGBDBM50496260(CHEMBL3127681)
Affinity DataIC50:  4.40nM. Assay description: Antagonist activity at human histamine H3 receptor long form expressed in CHOK1 cells assessed as inhibition of R-alpha-methylhistamine-induced [35S]...
Ligand InfoPC cidPC sid
In DepthDetails ArticlePubMed
TargetPotassium voltage-gated channel subfamily H member 2(Homo sapiens (Human))
Astrazeneca
Curated by ChEMBL
LigandPNGBDBM50496260(CHEMBL3127681)
Affinity DataIC50: >3.30E+4nM. Assay description: Inhibition of human ERG expressed in CHOK1 cells by electrophysiological analysis
Ligand InfoPC cidPC sid
In DepthDetails ArticlePubMed