BDBM50496286 CHEMBL3127684
SMILES CS(=O)(=O)N1CCC2(CC(C2)C(=O)N2CCN(CC2)C2CCC2)CC1
InChI Key InChIKey=LDGJAOJZZQIYNB-UHFFFAOYSA-N
Data  2 IC50
  Tab Delimited (TSV)   2D SDfile   Computed 3D by Vconf -m prep SDfile
Find this compound or compounds like it in BindingDB:
Activity Spreadsheet -- Enzyme Inhibition Constant Data from BindingDB
Found 2 hits for monomerid = 50496286
TargetPotassium voltage-gated channel subfamily H member 2(Homo sapiens (Human))
Astrazeneca
Curated by ChEMBL
LigandPNGBDBM50496286(CHEMBL3127684)
Affinity DataIC50: >3.30E+4nM. Assay description: Inhibition of human ERG expressed in CHOK1 cells by electrophysiological analysis
Ligand InfoPC cidPC sid
In DepthDetails ArticlePubMed
TargetHistamine H3 receptor(Homo sapiens (Human))
Astrazeneca
Curated by ChEMBL
LigandPNGBDBM50496286(CHEMBL3127684)
Affinity DataIC50:  11nM. Assay description: Antagonist activity at human histamine H3 receptor long form expressed in CHOK1 cells assessed as inhibition of R-alpha-methylhistamine-induced [35S]...
Ligand InfoPC cidPC sid
In DepthDetails ArticlePubMed