BDBM50496291 CHEMBL3127697
SMILES CN1CCN(CC1)C(=O)C1CC11CCN(CC1)C1CCOCC1
InChI Key InChIKey=ZBLAOOSANUIXDB-UHFFFAOYSA-N
Data  1 KI  1 IC50
  Tab Delimited (TSV)   2D SDfile   Computed 3D by Vconf -m prep SDfile
Find this compound or compounds like it in BindingDB:
Activity Spreadsheet -- Enzyme Inhibition Constant Data from BindingDB
Found 2 hits for monomerid = 50496291
TargetHistamine H3 receptor(Homo sapiens (Human))
Astrazeneca
Curated by ChEMBL
LigandPNGBDBM50496291(CHEMBL3127697)
Affinity DataKi:  1.30E+3nM. Assay description: Displacement of [3H]-N-alpha-methylhistamine from human histamine H3 receptor expressed in CHOK1 cells after 1.5 hrs by scintillation proximity assay
Ligand InfoPC cidPC sid
In DepthDetails ArticlePubMed
TargetHistamine H3 receptor(Homo sapiens (Human))
Astrazeneca
Curated by ChEMBL
LigandPNGBDBM50496291(CHEMBL3127697)
Affinity DataIC50:  1.10E+3nM. Assay description: Antagonist activity at human histamine H3 receptor long form expressed in CHOK1 cells assessed as inhibition of R-alpha-methylhistamine-induced [35S]...
Ligand InfoPC cidPC sid
In DepthDetails ArticlePubMed