BDBM50496296 CHEMBL3127704
SMILES O=C(C1CC11CCN(CC1)C1CCOCC1)N1CCCN(CC1)C1CCC1
InChI Key InChIKey=BDOPQVFPHYQRME-UHFFFAOYSA-N
Data  1 KI  1 IC50
  Tab Delimited (TSV)   2D SDfile   Computed 3D by Vconf -m prep SDfile
Find this compound or compounds like it in BindingDB:
Activity Spreadsheet -- Enzyme Inhibition Constant Data from BindingDB
Found 2 hits for monomerid = 50496296
TargetHistamine H3 receptor(Homo sapiens (Human))
Astrazeneca
Curated by ChEMBL
LigandPNGBDBM50496296(CHEMBL3127704)
Affinity DataKi:  3nM. Assay description: Displacement of [3H]-N-alpha-methylhistamine from human histamine H3 receptor expressed in CHOK1 cells after 1.5 hrs by scintillation proximity assay
Ligand InfoPC cidPC sid
In DepthDetails ArticlePubMed
TargetHistamine H3 receptor(Homo sapiens (Human))
Astrazeneca
Curated by ChEMBL
LigandPNGBDBM50496296(CHEMBL3127704)
Affinity DataIC50:  17nM. Assay description: Antagonist activity at human histamine H3 receptor long form expressed in CHOK1 cells assessed as inhibition of R-alpha-methylhistamine-induced [35S]...
Ligand InfoPC cidPC sid
In DepthDetails ArticlePubMed