BDBM50496735 CHEMBL1355048
SMILES CN(CCCc1cnc[nH]1)C(=S)NCCCN(Cc1ccc(Cl)cc1)c1ccc(Br)cn1
InChI Key InChIKey=XEMYFRXQEQGYLO-UHFFFAOYSA-N
Data  1 KI
  Tab Delimited (TSV)   2D SDfile   Computed 3D by Vconf -m prep SDfile
Find this compound or compounds like it in BindingDB:
Activity Spreadsheet -- Enzyme Inhibition Constant Data from BindingDB
Found 1 hit for monomerid = 50496735
TargetSomatostatin receptor type 4(Homo sapiens (Human))
National Human Genome Research Institute
Curated by ChEMBL
LigandPNGBDBM50496735(CHEMBL1355048)
Affinity DataKi:  26nM. Assay description: Binding affinity to human SST4 receptor
Ligand InfoPC cidPC sid
In DepthDetails ArticlePubMed