BDBM50496899 CHEMBL3237439
SMILES Cc1n[nH]c(C)c1CCc1nnc(o1)-c1sc2ccccc2c1OC1CCNCC1
InChI Key InChIKey=HNJCUSHLCUFLJA-UHFFFAOYSA-N
Data  1 KI
  Tab Delimited (TSV)   2D SDfile   Computed 3D by Vconf -m prep SDfile
Find this compound or compounds like it in BindingDB:
Activity Spreadsheet -- Enzyme Inhibition Constant Data from BindingDB
Found 1 hit for monomerid = 50496899
TargetGlycylpeptide N-tetradecanoyltransferase(Plasmodium falciparum (isolate 3D7))
Imperial College
Curated by ChEMBL
LigandPNGBDBM50496899(CHEMBL3237439)
Affinity DataKi:  226nM. Assay description: Inhibition of Plasmodium falciparum N-myristoyltransferase by CPM fluorescence assay
Ligand InfoPC cidPC sid
In DepthDetails ArticlePubMed