BDBM50496904 CHEMBL3237412
SMILES COc1cc(CCOC(=O)c2sc3ccccc3c2OC2CCNCC2)cc(OC)c1
InChI Key InChIKey=QQHYQLNXKKHLDE-UHFFFAOYSA-N
Data  1 KI
  Tab Delimited (TSV)   2D SDfile   Computed 3D by Vconf -m prep SDfile
Find this compound or compounds like it in BindingDB:
Activity Spreadsheet -- Enzyme Inhibition Constant Data from BindingDB
Found 1 hit for monomerid = 50496904
TargetGlycylpeptide N-tetradecanoyltransferase(Plasmodium falciparum (isolate 3D7))
Imperial College
Curated by ChEMBL
LigandPNGBDBM50496904(CHEMBL3237412)
Affinity DataKi:  26nM. Assay description: Inhibition of Plasmodium falciparum N-myristoyltransferase by CPM fluorescence assay
Ligand InfoPC cidPC sid
In DepthDetails ArticlePubMed