BDBM50496919 CHEMBL3237436
SMILES Cc1n[nH]c(C)c1Cc1nnc(o1)-c1sc2ccccc2c1OC1CCNCC1
InChI Key InChIKey=BSFSQCSQIOYTCL-UHFFFAOYSA-N
Data  1 KI
PDB links: 1 PDB ID matches this monomer.
  Tab Delimited (TSV)   2D SDfile   Computed 3D by Vconf -m prep SDfile
Find this compound or compounds like it in BindingDB:
Activity Spreadsheet -- Enzyme Inhibition Constant Data from BindingDB
Found 1 hit for monomerid = 50496919
TargetGlycylpeptide N-tetradecanoyltransferase(Plasmodium falciparum (isolate 3D7))
Imperial College
Curated by ChEMBL
LigandPNGBDBM50496919(CHEMBL3237436)
Affinity DataKi:  55nM. Assay description: Inhibition of Plasmodium falciparum N-myristoyltransferase by CPM fluorescence assay
Ligand InfoPC cidPC sidPDB
In DepthDetails ArticlePubMed