BDBM50497553 CHEMBL3359696
SMILES ONC(=O)C(NC(=O)c1ccccc1F)c1ccc(cc1)-n1cccn1
InChI Key InChIKey=VLCYMYIBZFAFLM-UHFFFAOYSA-N
Data  2 KI
  Tab Delimited (TSV)   2D SDfile   Computed 3D by Vconf -m prep SDfile
Find this compound or compounds like it in BindingDB:
Activity Spreadsheet -- Enzyme Inhibition Constant Data from BindingDB
Found 2 hits for monomerid = 50497553
TargetM17 leucyl aminopeptidase(Plasmodium falciparum 3D7)
Monash University
Curated by ChEMBL
LigandPNGBDBM50497553(CHEMBL3359696)
Affinity DataKi:  0.00800nM. Assay description: Inhibition of Plasmodium falciparum M17 incubated for 10 mins before H-Leu-NHMec substrate addition by fluorescence assay
Ligand InfoPC cidPC sid
In DepthDetails ArticlePubMed
TargetM1 family aminopeptidase(Plasmodium falciparum (isolate FcB1 / Columbia))
Monash University
Curated by ChEMBL
LigandPNGBDBM50497553(CHEMBL3359696)
Affinity DataKi:  1.90nM. Assay description: Inhibition of Plasmodium falciparum M1 incubated for 10 mins before H-Leu-NHMec substrate addition by fluorescence assay
Ligand InfoPC cidPC sid
In DepthDetails ArticlePubMed