BDBM50497806 CHEMBL3310895
SMILES OC[C@H]1O[C@@]2(S\C(NC2=O)=N/C(=O)c2ccc3ccccc3c2)[C@H](O)[C@@H](O)[C@@H]1O
InChI Key InChIKey=YJXSIZXIPBKFHB-ULPMNANESA-N
Data  1 KI
PDB links: 1 PDB ID matches this monomer.
  Tab Delimited (TSV)   2D SDfile   Computed 3D by Vconf -m prep SDfile
Find this compound or compounds like it in BindingDB:
Activity Spreadsheet -- Enzyme Inhibition Constant Data from BindingDB
Found 1 hit for monomerid = 50497806
TargetGlycogen phosphorylase, muscle form(Oryctolagus cuniculus (rabbit))
University Of Debrecen
Curated by ChEMBL
LigandPNGBDBM50497806(CHEMBL3310895)
Affinity DataKi:  1.00E+4nM. Assay description: Inhibition of rabbit muscle glycogen phosphorylase b at pH 6.8 assessed as inorganic phosphate release
Ligand InfoPC cidPC sidPDB