BDBM50497932 CHEMBL3341989
SMILES NC(=O)c1cnc(nc1[C@@H](O)CO)-c1ccc(Oc2cc(F)cc(Cl)c2)cc1
InChI Key InChIKey=LLJSUBVPVGCZIM-INIZCTEOSA-N
Data  1 KI  1 IC50
  Tab Delimited (TSV)   2D SDfile   Computed 3D by Vconf -m prep SDfile
Find this compound or compounds like it in BindingDB:
Activity Spreadsheet -- Enzyme Inhibition Constant Data from BindingDB
Found 2 hits for monomerid = 50497932
TargetSodium channel protein type 9 subunit alpha(Homo sapiens (Human))
Pfizer
Curated by ChEMBL
LigandPNGBDBM50497932(CHEMBL3341989)
Affinity DataKi:  27nM. Assay description: Inhibition of human Nav1.7 expressed in HEK293 cells by electrophysiology method
Ligand InfoPC cidPC sid
In DepthDetails ArticlePubMed
TargetSodium channel protein type 9 subunit alpha(Homo sapiens (Human))
Pfizer
Curated by ChEMBL
LigandPNGBDBM50497932(CHEMBL3341989)
Affinity DataIC50:  67nM. Assay description: Inhibition of human Nav1.7 expressed in HEK293 cells by FLIPR method
Ligand InfoPC cidPC sid
In DepthDetails ArticlePubMed