BDBM50498796 CHEMBL3623808
SMILES COc1ccc(cc1OC)[C@@H](O)COc1ccc(cc1OC)[C@H]1O[C@@H]([C@H](C)[C@H]1C)c1ccc(OC[C@H](O)c2ccc(OC)c(OC)c2)c(OC)c1
InChI Key InChIKey=NKHJQIMZBYZZNI-QEDKRPGDSA-N
Data  1 IC50
  Tab Delimited (TSV)   2D SDfile   Computed 3D by Vconf -m prep SDfile
Find this compound or compounds like it in BindingDB:
Activity Spreadsheet -- Enzyme Inhibition Constant Data from BindingDB
Found 1 hit for monomerid = 50498796
LigandPNGBDBM50498796(CHEMBL3623808)
Affinity DataIC50:  380nM. Assay description: Inhibition of HIF1 in human HEK293T cells transfected with pGL3-5HRE-VEGF and pRL-SV40 after 24 hrs by dual luciferase reporter assay
Ligand InfoPC cidPC sid
In DepthDetails ArticlePubMed