BDBM50499003 CHEMBL3735533
SMILES CC(C)n1c(C)nc2cnc(Nc3ccnc(n3)N3CCC(O)CC3)cc12
InChI Key InChIKey=CETLUXCQLCEHTG-UHFFFAOYSA-N
Data  1 KI
  Tab Delimited (TSV)   2D SDfile   Computed 3D by Vconf -m prep SDfile
Find this compound or compounds like it in BindingDB:
Activity Spreadsheet -- Enzyme Inhibition Constant Data from BindingDB
Found 1 hit for monomerid = 50499003
TargetEpidermal growth factor receptor(Homo sapiens (Human))
Argenta Discovery
Curated by ChEMBL
LigandPNGBDBM50499003(CHEMBL3735533)
Affinity DataKi:  34nM. Assay description: Inhibition of human EGFR T790M/L858R double mutant using Fl-EEPLYWSFPAKKK-CONH2 as substrate preincubated for 30 mins followed by addition of substra...
Ligand InfoPC cidPC sid
In DepthDetails ArticlePubMed