BDBM50500521 CHEMBL3746277
SMILES Cc1nc(C)c(CNc2nc(OCC3CC3c3cc(C)ccn3)nc(Cl)c2C)s1
InChI Key InChIKey=MLOPVEXBAIYYGS-UHFFFAOYSA-N
Data  1 KI
  Tab Delimited (TSV)   2D SDfile   Computed 3D by Vconf -m prep SDfile
Find this compound or compounds like it in BindingDB:
Activity Spreadsheet -- Enzyme Inhibition Constant Data from BindingDB
Found 1 hit for monomerid = 50500521
TargetcAMP and cAMP-inhibited cGMP 3',5'-cyclic phosphodiesterase 10A(Homo sapiens (Human))
Merck Research Laboratories
Curated by ChEMBL
LigandPNGBDBM50500521(CHEMBL3746277)
Affinity DataKi:  0.0100nM. Assay description: Inhibition of PDE10A (unknown origin) by IMAP assay
Ligand InfoPC cidPC sid
In DepthDetails ArticlePubMed