BDBM50503340 CHEMBL4468636
SMILES FC(F)(F)C(OC(=O)N1CCN(Cc2ccc(cc2N2CC3COCC3C2)C(F)(F)F)CC1)C(F)(F)F
InChI Key InChIKey=KOPDPPBFKXJXGN-UHFFFAOYSA-N
Data  4 IC50
  Tab Delimited (TSV)   2D SDfile   Computed 3D by Vconf -m prep SDfile
Find this compound or compounds like it in BindingDB:
Activity Spreadsheet -- Enzyme Inhibition Constant Data from BindingDB
Found 4 hits for monomerid = 50503340
TargetMonoacylglycerol lipase ABHD6(Homo sapiens (Human))
Abide Therapeutics
Curated by ChEMBL
LigandPNGBDBM50503340(CHEMBL4468636)
Affinity DataIC50:  2.70E+3nM. Assay description: Inhibition of ABHD6 derived from human PC3 cell lysates preincubated for 30 mins followed by JW912 addition after 30 mins by gel-based ABPP assay
Ligand InfoPC cidPC sid
In DepthDetails ArticlePubMed
TargetPlatelet-activating factor acetylhydrolase(Homo sapiens (Human))
Abide Therapeutics
Curated by ChEMBL
LigandPNGBDBM50503340(CHEMBL4468636)
Affinity DataIC50:  1.00E+3nM. Assay description: Inhibition of PLA2G7 derived from human PC3 cell lysates preincubated for 30 mins followed by JW912 addition after 30 mins by gel-based ABPP assay
Ligand InfoPC cidPC sid
In DepthDetails ArticlePubMed
TargetMonoglyceride lipase(Mus musculus (mouse))
Abide Therapeutics
Curated by ChEMBL
LigandPNGBDBM50503340(CHEMBL4468636)
Affinity DataIC50:  17nM. Assay description: Inhibition of MGLL derived from mouse brain homogenates preincubated for 30 mins followed by JW912 addition after 30 mins by gel-based ABPP assay
Ligand InfoPC cidPC sid
In DepthDetails ArticlePubMed
TargetMonoglyceride lipase(Homo sapiens (Human))
Abide Therapeutics
Curated by ChEMBL
LigandPNGBDBM50503340(CHEMBL4468636)
Affinity DataIC50:  2nM. Assay description: Inhibition of MGLL derived from human PC3 cell lysates preincubated for 30 mins followed by JW912 addition after 30 mins by gel-based ABPP assay
Ligand InfoPC cidPC sid
In DepthDetails ArticlePubMed