BDBM50505010 CHEMBL4455143
SMILES COCCOc1cc(ccc1Oc1ccccc1)-n1c(=O)[nH]c(=O)n(-c2cccc(Cl)c2)c1=O
InChI Key InChIKey=UKUOUPCEAVCEIE-UHFFFAOYSA-N
Data  3 EC50
  Tab Delimited (TSV)   2D SDfile   Computed 3D by Vconf -m prep SDfile
Find this compound or compounds like it in BindingDB:
Activity Spreadsheet -- Enzyme Inhibition Constant Data from BindingDB
Found 3 hits for monomerid = 50505010
TargetNT-3 growth factor receptor(Homo sapiens (Human))
Usona Institute
Curated by ChEMBL
LigandPNGBDBM50505010(CHEMBL4455143)
Affinity DataEC50:  180nM. Assay description: Agonist activity at TrkC (unknown origin) in expressed in U2OS cells incubated for 3 hrs and measured after 60 hrs in presence of NT-3 by fluorescenc...
Ligand InfoPC cidPC sid
In DepthDetails ArticlePubMed
TargetHigh affinity nerve growth factor receptor(Homo sapiens (Human))
Usona Institute
Curated by ChEMBL
LigandPNGBDBM50505010(CHEMBL4455143)
Affinity DataEC50:  220nM. Assay description: Agonist activity at TrkA (unknown origin) in expressed in U2OS cells incubated for 3 hrs and measured after 60 hrs in presence of NGF by fluorescence...
Ligand InfoPC cidPC sid
In DepthDetails ArticlePubMed
TargetBDNF/NT-3 growth factors receptor(Homo sapiens (Human))
Usona Institute
Curated by ChEMBL
LigandPNGBDBM50505010(CHEMBL4455143)
Affinity DataEC50:  230nM. Assay description: Agonist activity at TrkB (unknown origin) in expressed in U2OS cells incubated for 3 hrs and measured after 60 hrs in presence of BDNF by fluorescenc...
Ligand InfoPC cidPC sid
In DepthDetails ArticlePubMed