BDBM50506040 CHEMBL4536502
SMILES Clc1ccc2nc3c4cccc5cccc(c45)c(=O)n3c2c1
InChI Key InChIKey=ZJESJVGSDQOZAT-UHFFFAOYSA-N
Data  1 IC50
  Tab Delimited (TSV)   2D SDfile   Computed 3D by Vconf -m prep SDfile
Find this compound or compounds like it in BindingDB:
Activity Spreadsheet -- Enzyme Inhibition Constant Data from BindingDB
Found 1 hit for monomerid = 50506040
TargetAryl hydrocarbon receptor(Homo sapiens (Human))
University Of Perugia
Curated by ChEMBL
LigandPNGBDBM50506040(CHEMBL4536502)
Affinity DataIC50:  2.60nM. Assay description: Displacement of [3H] 3-MC from AhR (unknown origin)
In DepthDetails ArticlePubMed